{"text_format":"1","workbook":"xlsx","n_sheets":27,"sheets":["INÍCIO","Ingressantes","Concluintes","Matriculados","Cursos","C_CORR_COM_HU S_HU","Substituir","Parametros","ALUNO_GRAD_TEMPO_INTEGRAL","ALUNO_DE_GRADUAÇÃO","ALUNO_EQUIV_GRADUAÇÃO","APGTI","ALUNO_RESIDENTE","ALUNO_TEMPO_INTEGRAL","ALUNO_EQUIVALENTE","PROFESSOR_EQUIVALENTE","FUNCIONÁRIO_EQUIVALENTE_HU","CUSTO_HU_AE","ATI_PROFESSOR_EQUIVALENTE","ATI_FUNCIONÁRIO_COM_HU","FUNCIONÁRIO_PROF_EQUIV","GRAU_PARTICIPAÇÃO_ESTUDANTIL","GRAU_ENVOLVIMENTO_ALUNO_POS","CONCEITO_CAPES","QUALIFICAÇÃO DOCENTE","TAXA_DE_SUCESSO_NA_GRADUAÇÃO","INDICADORES_TCU"],"not_rendered":{"charts":19,"images":5,"macros":1,"external_links":0,"defined_names":10,"comments":4,"pivot_tables":1},"unopened":[],"bounds":{"document_bytes":16777216,"sheet_cells":100000,"rows_first":2000,"rows_last":500,"rows_between":2000,"halvings":0,"cell_chars":16384,"cell_head_chars":4096},"cells_cut":0,"cells_raw":0,"read":"whole","date_system":"1900"}

{"sheet":"INÍCIO","index":0,"n_rows":33,"n_cols":4,"rows_kept":33,"cut":false,"hidden":true,"merged":[]}
[]
[]
[]
[null,"Ano de elaboração:",2022]
[null,"Ano de referência:",{"$f":"C4-1","v":2021}]
[]
{"$rows_left_out":28}
{"sheet":"Ingressantes","index":1,"n_rows":1344,"n_cols":6,"rows_kept":1344,"cut":false,"hidden":true,"merged":[]}
["ANO","SEM","CURSO"," CURSOINEP","TURNO","ALUNOS"]
[2015,1,"ABI - CIÊNCIAS BIOLÓGICAS - 01ABI","   5000608","INTEGRAL",7]
[2015,1,"CIÊNCIAS BIOLÓGICAS - 01B","    313086","INTEGRAL",39]
[2015,1,"ADMINISTRAÇÃO - 01GV","   1178684","INTEGRAL",23]
[2015,1,"CIÊNCIAS BIOLÓGICAS - 01L","     13086","INTEGRAL",21]
[2015,1,"CIÊNCIAS CONTÁBEIS - 02GV","   1183351","INTEGRAL",31]
{"$rows_left_out":1339}
{"sheet":"Concluintes","index":2,"n_rows":229,"n_cols":8,"rows_kept":229,"cut":false,"hidden":true,"merged":[]}
["SEM","CURSO"," CURSOINEP","OPCAO","TURNO","CONCLUINTES",null,"os cursos medicina JF e enfermagem JF (em vermelho) não tinham ainda os concluintes totais de 2021/1, utilizamos os 2020/1"]
[1,"CIÊNCIAS BIOLÓGICAS - 01B","    313086","1-Bacharelado","INTEGRAL",4]
[1,"ADMINISTRAÇÃO - 01GV","   1178684","1-Bacharelado em Administração","INTEGRAL",7]
[1,"CIÊNCIAS BIOLÓGICAS - 01L","     13086","1-Licenciado","INTEGRAL",9]
[1,"CIÊNCIAS CONTÁBEIS - 02GV","   1183351","1-Bacharelado em Ciências Contábeis","INTEGRAL",1]
[1,"CIÊNCIAS ECONÔMICAS - 03GV","   1178683","1-Bacharelado","INTEGRAL",5]
{"$rows_left_out":224}
{"sheet":"Matriculados","index":3,"n_rows":358,"n_cols":5,"rows_kept":358,"cut":false,"hidden":true,"merged":[]}
["SEM","CURSO"," CURSOINEP","TURNO","MATRICULADOS"]
[1,"ABI - CIÊNCIAS BIOLÓGICAS - 01ABI","   5000608","INTEGRAL",60]
[1,"CIÊNCIAS BIOLÓGICAS - 01B","    313086","INTEGRAL",177]
[1,"ADMINISTRAÇÃO - 01GV","   1178684","INTEGRAL",280]
[1,"CIÊNCIAS BIOLÓGICAS - 01L","     13086","INTEGRAL",125]
[1,"CIÊNCIAS CONTÁBEIS - 02GV","   1183351","INTEGRAL",156]
{"$rows_left_out":353}
{"sheet":"Cursos","index":4,"n_rows":1929,"n_cols":3,"rows_kept":1929,"cut":false,"hidden":true,"merged":[]}
["CURSOS","CODIGO_INEP","Rótulos de Linha"]
["ABI - CIÊNCIAS BIOLÓGICAS - 01ABI","   5000608","ABI - CIÊNCIAS BIOLÓGICAS - 01ABI"]
["CIÊNCIAS BIOLÓGICAS - 01B","    313086","ABI - EDUCAÇÃO FÍSICA - 21ABI"]
["ADMINISTRAÇÃO - 01GV","   1178684","ABI - FILOSOFIA - 08ABI"]
["CIÊNCIAS BIOLÓGICAS - 01L","     13086","ABI - GEOGRAFIA - 10ABI"]
["CIÊNCIAS CONTÁBEIS - 02GV","   1183351","ABI - GEOGRAFIA - 27ABI"]
{"$rows_left_out":1924}
{"sheet":"C_CORR_COM_HU S_HU","index":5,"n_rows":32,"n_cols":6,"rows_kept":32,"cut":false,"hidden":false,"merged":[[31,0,31,3],[15,0,15,3],[14,0,14,3],[13,0,13,3],[21,0,21,4],[20,0,20,4],[22,0,22,3],[30,0,30,3],[29,0,29,3],[28,0,28,3],[27,0,27,3],[25,0,25,3],[26,0,26,3],[0,0,0,5],[6,0,6,4],[7,0,7,4],[24,0,24,3],[8,0,8,3],[17,0,17,3],[16,0,16,3],[9,0,9,3],[11,0,11,3],[10,0,10,3],[12,0,12,3],[23,0,23,3]]}
["CUSTO CORRENTE"]
[" ",2017,2018,2019,2020,2021]
["CUSTO CORRENTE S_HU",604855746.72000003,644483392.75,661885338.28999996,707077157.49000001,{"$f":"E18","v":733675198.40999997}]
["CUSTO CORRENTE C_HU",628553903.16999996,666190973.75,682548236.1400001,727731710.80000007,{"$f":"E32","v":754224765.39999998}]
[]
[]
{"$rows_left_out":27}
{"sheet":"Substituir","index":6,"n_rows":46,"n_cols":3,"rows_kept":46,"cut":false,"hidden":true,"merged":[]}
["CURSO ORIGINAL","CURSO CONVERTIDO","MÉTODO"]
["ABI - CIÊNCIAS SOCIAIS - 72C","CIÊNCIAS SOCIAIS - 72C","Integral"]
["ABI - CIÊNCIAS SOCIAIS - 73C","CIÊNCIAS SOCIAIS - 73C","Integral"]
["ABI - FILOSOFIA - 72E","FILOSOFIA - 72EB","Integral"]
["ABI - FILOSOFIA - 73E","FILOSOFIA - 73E","Integral"]
["COMUNICAÇÃO SOCIAL - 12A","JORNALISMO - 84A","Integral"]
{"$rows_left_out":41}
{"sheet":"Parametros","index":7,"n_rows":157,"n_cols":5,"rows_kept":157,"cut":false,"hidden":true,"merged":[]}
["CURSO","CÓDIGO INEP","DURAÇÃO DO CURSO","FATOR DE RETENÇÃO ","PESO DO GRUPO"]
["ABI - CIÊNCIAS BIOLÓGICAS - 01ABI",5000608,4,0.125,2]
["ABI - EDUCAÇÃO FÍSICA - 21ABI",5000610,5,6.6000000000000003E-2,1.5]
["ABI - FILOSOFIA - 08ABI",5000611,4,0.1,1]
["ABI - GEOGRAFIA - 10ABI",5000615,4,0.1,1]
["ABI - GEOGRAFIA - 27ABI",5000615,4,0.1,1]
{"$rows_left_out":152}
{"sheet":"ALUNO_GRAD_TEMPO_INTEGRAL","index":8,"n_rows":142,"n_cols":14,"rows_kept":142,"cut":false,"hidden":false,"merged":[[135,16,135,17],[123,9,123,10],[128,9,128,11],[126,16,126,17],[112,12,112,14],[112,15,112,18],[45,12,45,13],[0,0,0,6],[1,0,1,6],[2,12,2,13],[33,9,33,15],[32,9,32,15],[31,9,31,15],[29,9,30,15],[28,9,28,15]]}
["COMPONENTE",null,null,null,null,null,null,null,null,2017,2018,2019,2020,2021]
["ALUNO GRADUAÇÃO TEMPO INTEGRAL (AGTI)",null,null,null,null,null,null,null,null,13163,14314,15858.460000000001,15230.957999999995,{"$f":"G142","v":13479.108000000002}]
["CURSO","CÓDIGO INEP","NÚMERO DE DIPLOMADOS  (NDI) ","DURAÇÃO DO CURSO  (DPC)","FATOR DE RETENÇÃO ","INGRESSANTES NO ANO (NI)","AGTI"]
["ABI - CIÊNCIAS BIOLÓGICAS - 01ABI",{"$f":"VLOOKUP(A4,Parametros!A:E,2,0)","v":5000608},{"$f":"SUMIF(Concluintes!B:B,ALUNO_GRAD_TEMPO_INTEGRAL!A4,Concluintes!F:F)","v":0},{"$f":"VLOOKUP(A4,Parametros!A:E,3,0)","v":4},{"$f":"VLOOKUP(A4,Parametros!A:E,4,0)","v":0.125},{"$f":"SUMIFS(Ingressantes!F:F,Ingressantes!C:C,ALUNO_GRAD_TEMPO_INTEGRAL!A4,Ingressantes!A:A,INÍCIO!$C$5)","v":60},{"$f":"IFERROR(SUM((C4*D4)*(1+E4)+((F4-C4)/4)*D4),0)","v":60}]
["ABI - EDUCAÇÃO FÍSICA - 21ABI",{"$f":"VLOOKUP(A5,Parametros!A:E,2,0)","v":5000610},{"$f":"SUMIF(Concluintes!B:B,ALUNO_GRAD_TEMPO_INTEGRAL!A5,Concluintes!F:F)","v":0},{"$f":"VLOOKUP(A5,Parametros!A:E,3,0)","v":5},{"$f":"VLOOKUP(A5,Parametros!A:E,4,0)","v":6.6000000000000003E-2},{"$f":"SUMIFS(Ingressantes!F:F,Ingressantes!C:C,ALUNO_GRAD_TEMPO_INTEGRAL!A5,Ingressantes!A:A,INÍCIO!$C$5)","v":99},{"$f":"IFERROR(SUM((C5*D5)*(1+E5)+((F5-C5)/4)*D5),0)","v":123.75}]
["ABI - FILOSOFIA - 08ABI",{"$f":"VLOOKUP(A6,Parametros!A:E,2,0)","v":5000611},{"$f":"SUMIF(Concluintes!B:B,ALUNO_GRAD_TEMPO_INTEGRAL!A6,Concluintes!F:F)","v":0},{"$f":"VLOOKUP(A6,Parametros!A:E,3,0)","v":4},{"$f":"VLOOKUP(A6,Parametros!A:E,4,0)","v":0.1},{"$f":"SUMIFS(Ingressantes!F:F,Ingressantes!C:C,ALUNO_GRAD_TEMPO_INTEGRAL!A6,Ingressantes!A:A,INÍCIO!$C$5)","v":30},30]
{"$rows_left_out":137}
{"sheet":"ALUNO_DE_GRADUAÇÃO","index":9,"n_rows":142,"n_cols":12,"rows_kept":142,"cut":false,"hidden":false,"merged":[[7,20,7,21],[7,18,7,19],[51,6,51,7],[52,6,52,7],[8,20,8,21],[10,20,10,21],[11,20,11,21],[61,6,61,9],[0,0,0,4],[1,0,1,4],[62,6,62,9],[10,18,10,19],[54,6,54,7],[60,11,62,14],[11,18,11,19],[8,18,8,19]]}
[null,null,null,null,null,null,null,2017,2018,2019,2020,2021]
["ALUNO DE GRADUAÇÃO",null,null,null,null,null,null,19793,19829,20790,20039,{"$f":"E142","v":21198.5}]
["CURSO","CÓDIGO INEP","1º SEMESTRE","2º SEMESTRE","MATRICULAS"]
[{"$f":"ALUNO_GRAD_TEMPO_INTEGRAL!A4","v":"ABI - CIÊNCIAS BIOLÓGICAS - 01ABI"},{"$f":"ALUNO_GRAD_TEMPO_INTEGRAL!B4","v":5000608},{"$f":"SUMIFS(Matriculados!E:E,Matriculados!B:B,ALUNO_DE_GRADUAÇÃO!A4,Matriculados!A:A,1)","v":60},{"$f":"SUMIFS(Matriculados!E:E,Matriculados!B:B,ALUNO_DE_GRADUAÇÃO!A4,Matriculados!A:A,2)","v":78},{"$f":"AVERAGE(C4:D4)","v":69}]
[{"$f":"ALUNO_GRAD_TEMPO_INTEGRAL!A5","v":"ABI - EDUCAÇÃO FÍSICA - 21ABI"},{"$f":"ALUNO_GRAD_TEMPO_INTEGRAL!B5","v":5000610},{"$f":"SUMIFS(Matriculados!E:E,Matriculados!B:B,ALUNO_DE_GRADUAÇÃO!A5,Matriculados!A:A,1)","v":311},{"$f":"SUMIFS(Matriculados!E:E,Matriculados!B:B,ALUNO_DE_GRADUAÇÃO!A5,Matriculados!A:A,2)","v":342},{"$f":"AVERAGE(C5:D5)","v":326.5}]
[{"$f":"ALUNO_GRAD_TEMPO_INTEGRAL!A6","v":"ABI - FILOSOFIA - 08ABI"},{"$f":"ALUNO_GRAD_TEMPO_INTEGRAL!B6","v":5000611},{"$f":"SUMIFS(Matriculados!E:E,Matriculados!B:B,ALUNO_DE_GRADUAÇÃO!A6,Matriculados!A:A,1)","v":58},{"$f":"SUMIFS(Matriculados!E:E,Matriculados!B:B,ALUNO_DE_GRADUAÇÃO!A6,Matriculados!A:A,2)","v":39},48.5]
{"$rows_left_out":137}
{"sheet":"ALUNO_EQUIV_GRADUAÇÃO","index":10,"n_rows":142,"n_cols":14,"rows_kept":142,"cut":false,"hidden":false,"merged":[[0,0,0,6],[1,0,1,6],[51,10,51,11],[6,9,6,11],[51,12,51,13],[49,21,49,27],[33,9,33,19],[42,21,42,27],[43,21,43,27],[46,21,46,27],[47,21,47,27],[34,9,34,19],[48,21,48,27],[80,12,80,13],[79,12,79,13],[52,12,52,13],[84,10,84,13],[79,10,79,11],[52,10,52,11],[81,10,81,11],[78,10,78,13],[81,12,81,13],[80,10,80,11],[85,10,85,11],[82,10,82,11],[82,12,82,13],[106,13,106,21],[102,13,102,21],[103,13,103,21],[104,13,104,21],[105,13,105,21],[88,10,88,11],[88,12,88,13],[87,12,87,13],[87,10,87,11],[86,12,86,13],[85,12,85,13],[86,10,86,11]]}
["COMPONENTE ",null,null,null,null,null,null,null,null,2017,2018,2019,2020,2021]
["ALUNO EQUIVALENTE DE GRADUAÇÃO",null,null,null,null,null,null,null,null,24860,25188,27646.524999999991,29985.690999999992,{"$f":"G142","v":27663.625999999989}]
["CURSO","NÚMERO DE DIPLOMADOS  (NDI)","DURAÇÃO DO CURSO  (DPC)","FATOR DE RETENÇÃO ","INGRESSANTES NO ANO (NI)","PESO DO GRUPO ","AEG"]
[{"$f":"ALUNO_GRAD_TEMPO_INTEGRAL!A4","v":"ABI - CIÊNCIAS BIOLÓGICAS - 01ABI"},{"$f":"ALUNO_GRAD_TEMPO_INTEGRAL!C4","v":0},{"$f":"ALUNO_GRAD_TEMPO_INTEGRAL!D4","v":4},{"$f":"ALUNO_GRAD_TEMPO_INTEGRAL!E4","v":0.125},{"$f":"ALUNO_GRAD_TEMPO_INTEGRAL!F4","v":60},{"$f":"VLOOKUP(A4,Parametros!A:E,5,0)","v":2},{"$f":"IFERROR(SUM(((B4*C4)*(1+D4)+((E4-B4)/4)*C4)*F4),0)","v":120}]
[{"$f":"ALUNO_GRAD_TEMPO_INTEGRAL!A5","v":"ABI - EDUCAÇÃO FÍSICA - 21ABI"},{"$f":"ALUNO_GRAD_TEMPO_INTEGRAL!C5","v":0},{"$f":"ALUNO_GRAD_TEMPO_INTEGRAL!D5","v":5},{"$f":"ALUNO_GRAD_TEMPO_INTEGRAL!E5","v":6.6000000000000003E-2},{"$f":"ALUNO_GRAD_TEMPO_INTEGRAL!F5","v":99},{"$f":"VLOOKUP(A5,Parametros!A:E,5,0)","v":1.5},{"$f":"IFERROR(SUM(((B5*C5)*(1+D5)+((E5-B5)/4)*C5)*F5),0)","v":185.625}]
[{"$f":"ALUNO_GRAD_TEMPO_INTEGRAL!A6","v":"ABI - FILOSOFIA - 08ABI"},{"$f":"ALUNO_GRAD_TEMPO_INTEGRAL!C6","v":0},{"$f":"ALUNO_GRAD_TEMPO_INTEGRAL!D6","v":4},{"$f":"ALUNO_GRAD_TEMPO_INTEGRAL!E6","v":0.1},{"$f":"ALUNO_GRAD_TEMPO_INTEGRAL!F6","v":30},{"$f":"VLOOKUP(A6,Parametros!A:E,5,0)","v":1},30]
{"$rows_left_out":137}
{"sheet":"APGTI","index":11,"n_rows":77,"n_cols":12,"rows_kept":77,"cut":false,"hidden":false,"merged":[[63,6,66,11],[0,3,2,3],[48,8,48,11],[4,6,4,7],[54,8,54,11],[41,8,41,11],[8,5,10,5],[0,1,2,1],[0,2,2,2],[56,6,56,11],[57,6,57,11],[55,8,55,11],[40,6,40,11],[54,6,54,7],[8,4,10,4]]}
["COMPONENTE ","1º SEM","2º SEM","MATRICULAS",null,null,"ANO",2017,2018,2019,2020,2021]
["ALUNO DE PÓS-GRADUAÇÃO TEMPO INTEGRAL ",null,null,null,null,null,"APG (MATRICULAS)",2333.08,2815.5,2791.5,2482.5,{"$f":"D76","v":2907}]
["CURSO",null,null,null,null,null,"APGTI",4666.17,5631,5583,4965,{"$f":"D77","v":5814}]
["DISCIPLINA ISOLADA",47,45,{"$f":"AVERAGE(B4:C4)","v":46}]
["DOUTORADO EM ARTES, CULTURA E LINGUAGENS",25,23,{"$f":"AVERAGE(B5:C5)","v":24}]
["DOUTORADO EM BIODIVERSIDADE E CONSERVAÇÃO DA NATUREZA",37,28,32.5]
{"$rows_left_out":72}
{"sheet":"ALUNO_RESIDENTE","index":12,"n_rows":49,"n_cols":12,"rows_kept":49,"cut":false,"hidden":false,"merged":[[42,0,42,2],[0,3,2,3],[2,7,2,9],[0,1,2,1],[0,2,2,2]]}
["COMPONENTE ","1º SEM","2º SEM","Alunos Matriculados",null,null,null,2017,2018,2019,2020,2021]
["NÚMERO DE ALUNOS TEMPO INTEGRAL DE RESIDÊNCIA (ARTI)",null,null,null,null,null,null,549,533,547,529,{"$f":"D43","v":541}]
["RESIDÊNCIA"]
["ANÁLISES CLÍNICAS*",0,0,0,null,null,null,"FÓRMULA PARA CÁLCULO ARTI",null,null,null,"ARTI = 2  AR"]
["ANESTESIOLOGIA",11,11,{"$f":"(B5+C5)/2","v":11}]
["CARDIOLOGIA",3,3,3]
{"$rows_left_out":44}
{"sheet":"ALUNO_TEMPO_INTEGRAL","index":13,"n_rows":12,"n_cols":8,"rows_kept":12,"cut":false,"hidden":false,"merged":[[9,0,9,3],[10,0,10,3],[0,0,0,5],[1,0,1,5]]}
["COMPONENTE "]
["ALUNO TEMPO INTEGRAL"]
["ANO",2017,2018,2019,2020,2021]
["AGTI",{"$f":"ALUNO_GRAD_TEMPO_INTEGRAL!J2","v":13163},{"$f":"ALUNO_GRAD_TEMPO_INTEGRAL!K2","v":14314},{"$f":"ALUNO_GRAD_TEMPO_INTEGRAL!L2","v":15858.460000000001},{"$f":"ALUNO_GRAD_TEMPO_INTEGRAL!M2","v":15230.957999999995},{"$f":"ALUNO_GRAD_TEMPO_INTEGRAL!N2","v":13479.108000000002}]
["APGTI",{"$f":"APGTI!H3","v":4666.17},{"$f":"APGTI!I3","v":5631},{"$f":"APGTI!J3","v":5583},{"$f":"APGTI!K3","v":4965},{"$f":"APGTI!L3","v":5814}]
["ARTI",{"$f":"ALUNO_RESIDENTE!H2","v":549},{"$f":"ALUNO_RESIDENTE!I2","v":533},{"$f":"ALUNO_RESIDENTE!J2","v":547},{"$f":"ALUNO_RESIDENTE!K2","v":529},{"$f":"ALUNO_RESIDENTE!L2","v":541}]
{"$rows_left_out":7}
{"sheet":"ALUNO_EQUIVALENTE","index":14,"n_rows":12,"n_cols":6,"rows_kept":12,"cut":false,"hidden":false,"merged":[[10,0,10,3],[0,0,0,5],[1,0,1,5],[11,0,11,3]]}
["COMPONENTE "]
["ALUNO EQUIVALENTE"]
[null,2017,2018,2019,2020,2021]
["AGE (GRADUAÇÃO)",{"$f":"ALUNO_EQUIV_GRADUAÇÃO!J2","v":24860},{"$f":"ALUNO_EQUIV_GRADUAÇÃO!K2","v":25188},{"$f":"ALUNO_EQUIV_GRADUAÇÃO!L2","v":27646.524999999991},{"$f":"ALUNO_EQUIV_GRADUAÇÃO!M2","v":29985.690999999992},{"$f":"ALUNO_EQUIV_GRADUAÇÃO!N2","v":27663.625999999989}]
["APGTI",{"$f":"APGTI!H3","v":4666.17},{"$f":"APGTI!I3","v":5631},{"$f":"APGTI!J3","v":5583},{"$f":"APGTI!K3","v":4965},{"$f":"APGTI!L3","v":5814}]
["ARTI",{"$f":"ALUNO_RESIDENTE!H2","v":549},{"$f":"ALUNO_RESIDENTE!I2","v":533},{"$f":"ALUNO_RESIDENTE!J2","v":547},{"$f":"ALUNO_RESIDENTE!K2","v":529},{"$f":"ALUNO_RESIDENTE!L2","v":541}]
{"$rows_left_out":7}
{"sheet":"PROFESSOR_EQUIVALENTE","index":15,"n_rows":20,"n_cols":12,"rows_kept":20,"cut":false,"hidden":false,"merged":[[0,0,0,4],[1,0,1,4],[2,0,2,4],[18,0,18,2],[19,0,19,2],[17,0,17,2],[16,0,16,2],[13,0,13,3],[14,0,15,3]]}
["COMPONENTE",null,null,null,null,null,null,2017,2018,2019,2020,2021]
["PROFESSOR EQUIVALENTE",null,null,null,null,null,null,1490,1546,1550.5,1530.5,{"$f":"E8","v":1540.5}]
["REGIME DE TRABALHO"]
[null,"20 HORAS","40 HORAS + DE","PROFESSORES","EQUIVALENTE"]
["EM EXERCÍCIO EFETIVO ",110,1406,{"$f":"SUM(B5:C5)","v":1516},{"$f":"SUM(B5*$D$18+C5*$D$19)","v":1461}]
["SUBSTITUTOS E VISITANTES",22,137,{"$f":"SUM(B6:C6)","v":159},{"$f":"SUM(B6*$D$18+C6*$D$19)","v":148}]
{"$rows_left_out":15}
{"sheet":"FUNCIONÁRIO_EQUIVALENTE_HU","index":16,"n_rows":31,"n_cols":17,"rows_kept":31,"cut":false,"hidden":false,"merged":[[0,0,0,8],[1,0,1,8],[29,0,29,4],[30,0,31,4],[26,0,26,4],[27,0,28,4],[2,7,3,8],[13,0,16,0],[18,0,23,0],[2,1,2,6]]}
["COMPONENTE PARCIALMENTE AJUSTADO",null,null,null,null,null,null,null,null,null,null,null,2017,2018,2019,2020,2021]
["FUNCIONÁRIO EQUIVALENTE ",null,null,null,null,null,null,null,null,null,null,"COM_HU",2646,2711,2692.95,2674.2,{"$f":"I10","v":2481.8000000000002}]
[" ","TOTAL DE FUNCIONÁRIOS",null,null,null,null,null,"FUNC. EQUIVALENTE",null,null,null,"SEM_H.U.",2370,2453,2457.25,2446.5,{"$f":"I11","v":2272.2000000000003}]
["REGIME DE TRABALHO","12h","20 h","24 h","30 h","40 h","44h"]
["PROFESSORES ENSINO MÉDIO",0,0,0,0,111,0,{"$f":"SUM(B5:G5)","v":111},{"$f":"SUM(B5*0.3+C5*0.5+D5*0.6+E5*0.75+F5+G5*1.1)","v":111}]
["QUADRO PERMANENTE_UFJF",0,6,20,20,1232,0,{"$f":"SUM(B6:G6)","v":1278},1262]
{"$rows_left_out":26}
{"sheet":"CUSTO_HU_AE","index":17,"n_rows":16,"n_cols":6,"rows_kept":16,"cut":false,"hidden":false,"merged":[[11,0,11,2],[14,1,14,3],[15,1,15,3],[13,0,13,3],[0,0,0,5],[1,0,1,5]]}
["INDICADOR"]
["CUSTO CORRENTE COM E SEM HU"]
[null,2017,2018,2019,2020,2021]
["AE",{"$f":"ALUNO_EQUIVALENTE!B7","v":30075.17},{"$f":"ALUNO_EQUIVALENTE!C7","v":31352},{"$f":"ALUNO_EQUIVALENTE!D7","v":33776.524999999994},{"$f":"ALUNO_EQUIVALENTE!E7","v":35479.690999999992},{"$f":"ALUNO_EQUIVALENTE!F7","v":34018.625999999989}]
["CUSTO CORRENTE C_HU",{"$f":"'C_CORR_COM_HU S_HU'!B4","v":628553903.16999996},{"$f":"'C_CORR_COM_HU S_HU'!C4","v":666190973.75},{"$f":"'C_CORR_COM_HU S_HU'!D4","v":682548236.1400001},{"$f":"'C_CORR_COM_HU S_HU'!E4","v":727731710.80000007},{"$f":"'C_CORR_COM_HU S_HU'!F4","v":754224765.39999998}]
["CUSTO CORRENTE S_HU",{"$f":"'C_CORR_COM_HU S_HU'!B3","v":604855746.72000003},{"$f":"'C_CORR_COM_HU S_HU'!C3","v":644483392.75},{"$f":"'C_CORR_COM_HU S_HU'!D3","v":661885338.28999996},{"$f":"'C_CORR_COM_HU S_HU'!E3","v":707077157.49000001},{"$f":"'C_CORR_COM_HU S_HU'!F3","v":733675198.40999997}]
{"$rows_left_out":11}
{"sheet":"ATI_PROFESSOR_EQUIVALENTE","index":18,"n_rows":11,"n_cols":6,"rows_kept":11,"cut":false,"hidden":false,"merged":[[10,0,10,3],[9,0,9,3],[0,0,0,5],[1,0,1,5]]}
["INDICADOR "]
["ALUNO TEMPO INTEGRAL_PROFESSOR EQUIVALENTE"]
["ANO",2017,2018,2019,2020,2021]
["ATI",{"$f":"ALUNO_TEMPO_INTEGRAL!B7","v":18378.169999999998},{"$f":"ALUNO_TEMPO_INTEGRAL!C7","v":20478},{"$f":"ALUNO_TEMPO_INTEGRAL!D7","v":21988.46},{"$f":"ALUNO_TEMPO_INTEGRAL!E7","v":20724.957999999995},{"$f":"ALUNO_TEMPO_INTEGRAL!F7","v":19834.108}]
["PROFESSOR EQUIVALENTE",{"$f":"PROFESSOR_EQUIVALENTE!H2","v":1490},{"$f":"PROFESSOR_EQUIVALENTE!I2","v":1546},{"$f":"PROFESSOR_EQUIVALENTE!J2","v":1550.5},{"$f":"PROFESSOR_EQUIVALENTE!K2","v":1530.5},{"$f":"PROFESSOR_EQUIVALENTE!L2","v":1540.5}]
["ATI_PROFESSOR_EQUIVALENTE",{"$f":"B4/B5","v":12.334342281879193},{"$f":"C4/C5","v":13.245795601552393},{"$f":"D4/D5","v":14.181528539180908},{"$f":"E4/E5","v":13.541298921920937},{"$f":"F4/F5","v":12.875110678351184}]
{"$rows_left_out":6}
{"sheet":"ATI_FUNCIONÁRIO_COM_HU","index":19,"n_rows":14,"n_cols":9,"rows_kept":14,"cut":false,"hidden":false,"merged":[[4,3,4,5],[0,0,0,1],[1,0,1,1],[12,0,12,1],[13,0,13,1]]}
["INDICADOR ATUALIZADO PARCIALMENTE",null,null,null,2017,2018,2019,2020,2021]
["ALUNO TEMPO INTEGRAL FUNCIONÁRIO",null,null,"COM_HU",6.95,7.55,8.2795670175829486,7.7499655971879431,{"$f":"B3/B4","v":7.9918236763639285}]
["ATI",{"$f":"ALUNO_TEMPO_INTEGRAL!F7","v":19834.108},null,"SEM_HU",7.75,8.35,9.0737450401872,8.4712683425301432,{"$f":"B6/B7","v":8.7290326555760931}]
["FUNCIONÁRIO EQUIVALENTE_C_HU",{"$f":"FUNCIONÁRIO_EQUIVALENTE_HU!Q2","v":2481.8000000000002}," "]
[null,null," "]
["ATI",{"$f":"B3","v":19834.108}]
{"$rows_left_out":9}
{"sheet":"FUNCIONÁRIO_PROF_EQUIV","index":20,"n_rows":14,"n_cols":9,"rows_kept":14,"cut":false,"hidden":false,"merged":[[0,0,0,1],[1,0,1,1],[11,0,12,1],[13,0,13,1]]}
["INDICADOR ",null,null,null,2017,2018,2019,2020,2021]
["FUNCIONARIO EQUIVALENTE_PROFESSOR EQUIVALENTE",null,null,"COM_HU",1.78,1.75,1.7368268300548209,1.7472721332897745,{"$f":"B3/B4","v":1.6110353781239859}]
["FUNCIONÁRIO EQUIVALENTE_C_HU",{"$f":"FUNCIONÁRIO_EQUIVALENTE_HU!Q2","v":2481.8000000000002},null,"SEM_HU",1.59,1.59,1.5848113511770396,1.5984972231296961,{"$f":"B6/B7","v":1.4749756572541384}]
["PROFESSOR EQUIVALENTE",{"$f":"PROFESSOR_EQUIVALENTE!E8","v":1540.5}]
[]
["FUNCIONÁRIO EQUIVALENTE_S_HU",{"$f":"FUNCIONÁRIO_EQUIVALENTE_HU!Q3","v":2272.2000000000003}]
{"$rows_left_out":9}
{"sheet":"GRAU_PARTICIPAÇÃO_ESTUDANTIL","index":21,"n_rows":10,"n_cols":9,"rows_kept":10,"cut":false,"hidden":false,"merged":[[0,0,0,1],[1,0,1,1],[7,0,8,1],[9,0,10,1]]}
["INDICADOR",null,null,null,2017,2018,2019,2020,2021]
["GRAU DE PARTICIPAÇÃO ESTUDANTIL",null,null,null,0.67,0.72,0.7627926887926888,0.76006577174509682,{"$f":"B3/B4","v":0.63585197065830135}]
["AGTI",{"$f":"ALUNO_GRAD_TEMPO_INTEGRAL!N2","v":13479.108000000002}]
["AG",{"$f":"ALUNO_DE_GRADUAÇÃO!L2","v":21198.5}]
[]
[]
{"$rows_left_out":5}
{"sheet":"GRAU_ENVOLVIMENTO_ALUNO_POS","index":22,"n_rows":12,"n_cols":9,"rows_kept":12,"cut":false,"hidden":false,"merged":[[0,0,0,1],[1,0,1,1],[9,0,10,1],[11,0,11,1]]}
["INDICADOR ",null,null,null,2017,2018,2019,2020,2021]
["GRAU DE ENVOLVIMENTO DOS ALUNOS DA PÓS",null,null,null,0.11,0.12,0.12409681700406563,0.11022800435139755,{"$f":"B3/(B3+B4)","v":0.12059488498475451}]
["APG",{"$f":"APGTI!L2","v":2907}]
["AG",{"$f":"ALUNO_DE_GRADUAÇÃO!L2","v":21198.5}]
[]
[]
{"$rows_left_out":7}
{"sheet":"CONCEITO_CAPES","index":23,"n_rows":42,"n_cols":9,"rows_kept":42,"cut":false,"hidden":false,"merged":[[0,0,0,1],[1,0,1,1],[39,5,39,7],[39,8,39,10],[30,4,30,9],[31,4,32,9],[38,5,38,7],[38,8,38,10]]}
["INDICADOR",null,null,null,2017,2018,2019,2020,2021]
["CONCEITO CAPES",null,null,null,3.88,4.03,4,4.0294117647058822,{"$f":"B38","v":4.0294117647058822}]
["CURSO","CONCEITO"]
["PROGRAMA EM ADMINISTRAÇÃO ",3]
["PROGRAMA EM AMBIENTE CONSTRUÍDO",4]
["PROGRAMA EM ARTES, CULTURA E LINGUAGENS",4]
{"$rows_left_out":37}
{"sheet":"QUALIFICAÇÃO DOCENTE","index":24,"n_rows":27,"n_cols":9,"rows_kept":27,"cut":false,"hidden":false,"merged":[[9,4,9,5],[7,0,7,1],[10,0,10,1],[11,0,12,1],[0,0,0,2]]}
["QUALIFICAÇÃO DO CORPO DOCENTE - SOMENTE DEDICAÇÃO EXCLUSIVA",null,null,null,2017,2018,2019,2020,2021]
["TITULAÇÃO","PROFESSORES","QUALIFICAÇÃO",null,4.6500000000000004,4.71,4.7312138728323703,4.7681584739545118,{"$f":"C8","v":4.8133828996282526}]
["DOUTORADO",1226,{"$f":"SUM(B3*B24)","v":6130}]
["MESTRADO",108,{"$f":"SUM(B4*B25)","v":324}]
["ESPECIALIZAÇÃO",9,{"$f":"SUM(B5*B26)","v":18}]
["GRADUAÇÃO",2,{"$f":"SUM(B6*B27)","v":2}]
{"$rows_left_out":22}
{"sheet":"TAXA_DE_SUCESSO_NA_GRADUAÇÃO","index":25,"n_rows":141,"n_cols":14,"rows_kept":141,"cut":false,"hidden":false,"merged":[[12,9,12,15],[13,9,14,15],[43,9,43,11],[42,9,42,11],[4,9,4,13],[5,9,5,13],[40,9,40,11],[41,9,41,11]]}
[null,null,null,null,null,null,null,null,null,2017,2018,2019,2020,2021]
["CURSO","CÓDIGO INEP","DURAÇÃO DO CURSO","ANO DE INGRESSO","CONCLUINTES","INGRESSANTES ANTERIORES","TSG",null,null,0.49559999999999998,0.47220000000000001,0.56240000000000001,0.49387456573413785,{"$f":"N9","v":0.42122842827982926}]
[{"$f":"ALUNO_GRAD_TEMPO_INTEGRAL!A4","v":"ABI - CIÊNCIAS BIOLÓGICAS - 01ABI"},{"$f":"ALUNO_GRAD_TEMPO_INTEGRAL!B4","v":5000608},{"$f":"ALUNO_GRAD_TEMPO_INTEGRAL!D4","v":4},{"$f":"INÍCIO!$C$4-C3","v":2018},{"$f":"ALUNO_GRAD_TEMPO_INTEGRAL!C4","v":0},{"$f":"SUMIFS(Ingressantes!F:F,Ingressantes!C:C,TAXA_DE_SUCESSO_NA_GRADUAÇÃO!A3,Ingressantes!A:A,TAXA_DE_SUCESSO_NA_GRADUAÇÃO!D3)","v":18},{"$f":"IF(E3=0,,IF(F3=0,,E3/F3))","v":0}]
[{"$f":"ALUNO_GRAD_TEMPO_INTEGRAL!A5","v":"ABI - EDUCAÇÃO FÍSICA - 21ABI"},{"$f":"ALUNO_GRAD_TEMPO_INTEGRAL!B5","v":5000610},{"$f":"ALUNO_GRAD_TEMPO_INTEGRAL!D5","v":5},{"$f":"INÍCIO!$C$4-C4","v":2017},{"$f":"ALUNO_GRAD_TEMPO_INTEGRAL!C5","v":0},{"$f":"SUMIFS(Ingressantes!F:F,Ingressantes!C:C,TAXA_DE_SUCESSO_NA_GRADUAÇÃO!A4,Ingressantes!A:A,TAXA_DE_SUCESSO_NA_GRADUAÇÃO!D4)","v":88},{"$f":"IF(E4=0,,IF(F4=0,,E4/F4))","v":0}]
[{"$f":"ALUNO_GRAD_TEMPO_INTEGRAL!A6","v":"ABI - FILOSOFIA - 08ABI"},{"$f":"ALUNO_GRAD_TEMPO_INTEGRAL!B6","v":5000611},{"$f":"ALUNO_GRAD_TEMPO_INTEGRAL!D6","v":4},{"$f":"INÍCIO!$C$4-C5","v":2018},{"$f":"ALUNO_GRAD_TEMPO_INTEGRAL!C6","v":0},{"$f":"SUMIFS(Ingressantes!F:F,Ingressantes!C:C,TAXA_DE_SUCESSO_NA_GRADUAÇÃO!A5,Ingressantes!A:A,TAXA_DE_SUCESSO_NA_GRADUAÇÃO!D5)","v":26},0,null,null,"INDICADOR "]
[{"$f":"ALUNO_GRAD_TEMPO_INTEGRAL!A7","v":"ABI - GEOGRAFIA - 10ABI"},{"$f":"ALUNO_GRAD_TEMPO_INTEGRAL!B7","v":5000615},{"$f":"ALUNO_GRAD_TEMPO_INTEGRAL!D7","v":4},{"$f":"INÍCIO!$C$4-C6","v":2018},{"$f":"ALUNO_GRAD_TEMPO_INTEGRAL!C7","v":0},{"$f":"SUMIFS(Ingressantes!F:F,Ingressantes!C:C,TAXA_DE_SUCESSO_NA_GRADUAÇÃO!A6,Ingressantes!A:A,TAXA_DE_SUCESSO_NA_GRADUAÇÃO!D6)","v":15},0,null,null,"TAXA DE SUCESSO NA GRADUAÇÃO_2019 (TSG)"]
{"$rows_left_out":136}
{"sheet":"INDICADORES_TCU","index":26,"n_rows":32,"n_cols":6,"rows_kept":32,"cut":false,"hidden":false,"merged":[]}
["SÉRIE HISTÓRICA - INDICADORES DE GESTÃO"]
["INDICADORES PRIMÁRIOS",2017,2018,2019,2020,2021]
["CUSTO CORRENTE INCLUINDO 35% DAS DESPESAS DOS HU(S)",{"$f":"'C_CORR_COM_HU S_HU'!B4","v":628553903.16999996},{"$f":"'C_CORR_COM_HU S_HU'!C4","v":666190973.75},{"$f":"'C_CORR_COM_HU S_HU'!D4","v":682548236.1400001},{"$f":"'C_CORR_COM_HU S_HU'!E4","v":727731710.80000007},{"$f":"'C_CORR_COM_HU S_HU'!F4","v":754224765.39999998}]
["CUSTO CORRENTE EXCLUINDO AS DESPESAS DOS HU(S)",{"$f":"'C_CORR_COM_HU S_HU'!B$3","v":604855746.72000003},{"$f":"'C_CORR_COM_HU S_HU'!C$3","v":644483392.75},{"$f":"'C_CORR_COM_HU S_HU'!D$3","v":661885338.28999996},{"$f":"'C_CORR_COM_HU S_HU'!E$3","v":707077157.49000001},{"$f":"'C_CORR_COM_HU S_HU'!F$3","v":733675198.40999997}]
["NÚMERO DE ALUNOS TEMPO INTEGRAL",{"$f":"ALUNO_TEMPO_INTEGRAL!B7","v":18378.169999999998},{"$f":"ALUNO_TEMPO_INTEGRAL!C7","v":20478},{"$f":"ALUNO_TEMPO_INTEGRAL!D7","v":21988.46},{"$f":"ALUNO_TEMPO_INTEGRAL!E7","v":20724.957999999995},{"$f":"ALUNO_TEMPO_INTEGRAL!F7","v":19834.108}]
["NÚMERO DE ALUNOS EQUIVALENTES = AGE+APGTI+ARTI",{"$f":"ALUNO_EQUIVALENTE!B7","v":30075.17},{"$f":"ALUNO_EQUIVALENTE!C7","v":31352},{"$f":"ALUNO_EQUIVALENTE!D7","v":33776.524999999994},{"$f":"ALUNO_EQUIVALENTE!E7","v":35479.690999999992},{"$f":"ALUNO_EQUIVALENTE!F7","v":34018.625999999989}]
{"$rows_left_out":26}